{"text_format":"3","workbook":"xlsx","n_sheets":3,"sheets":["Sheet1","添加、修改、删除会员单位信息总表","Sheet3"],"not_rendered":{"defined_names":3},"read":"whole","date_system":"1900"}

{"sheet":"Sheet1","index":0,"n_rows":68,"n_cols":9,"rows_kept":68,"merged":[[0,0,0,4]]}
["2022年企业申报项目信息汇总"]
["序号","单位名称","申报项目","主营产品","排名","会员等级","会费标准","缴费情况","备注"]
[1,"天津智易时代科技发展有限公司","国家专精特新小巨人企业","品扬尘在线监测仪","天津前三",{"$f":"VLOOKUP(Sheet1!B3,'添加、修改、删除会员单位信息总表'!$A$1:$E$1505,4,FALSE)","v":"一般会员单位"},{"$f":"VLOOKUP(B3,'添加、修改、删除会员单位信息总表'!$A$1:$E$1505,5,FALSE)","v":2000},{"$f":"VLOOKUP(B3,'添加、修改、删除会员单位信息总表'!$A$1:$C$1505,2,FALSE)","v":2000}]
[2,"杭州思看科技有限公司","国家专精特新小巨人企业","手持式激光三维扫描仪","国内市场位居第一",{"$f":"VLOOKUP(Sheet1!B4,'添加、修改、删除会员单位信息总表'!$A$1:$E$1505,4,FALSE)","v":"一般会员单位"},{"$f":"VLOOKUP(B4,'添加、修改、删除会员单位信息总表'!$A$1:$E$1505,5,FALSE)","v":2000},{"$f":"VLOOKUP(B4,'添加、修改、删除会员单位信息总表'!$A$1:$C$1505,2,FALSE)","v":0}]
[3,"广州市晶华精密光学股份有限公司","国家专精特新小巨人企业","天文望远镜和双筒望远镜","国内市场位居第一",{"$f":"VLOOKUP(Sheet1!B5,'添加、修改、删除会员单位信息总表'!$A$1:$E$1505,4,FALSE)","v":"一般会员单位"},{"$f":"VLOOKUP(B5,'添加、修改、删除会员单位信息总表'!$A$1:$E$1505,5,FALSE)","v":2000},{"$f":"VLOOKUP(B5,'添加、修改、删除会员单位信息总表'!$A$1:$C$1505,2,FALSE)","v":2000}]
[4,"青天伟业仪器仪表有限公司","国家专精特新小巨人企业","电磁流量计及电磁流量传感器","河南省前列",{"$f":"VLOOKUP(Sheet1!B6,'添加、修改、删除会员单位信息总表'!$A$1:$E$1505,4,FALSE)","v":"一般会员单位"},{"$f":"VLOOKUP(B6,'添加、修改、删除会员单位信息总表'!$A$1:$E$1505,5,FALSE)","v":2000},{"$f":"VLOOKUP(B6,'添加、修改、删除会员单位信息总表'!$A$1:$C$1505,2,FALSE)","v":2000}]
[5,"余姚市三力信电磁阀有限公司","国家专精特新小巨人企业","高性能流体电磁阀","国内市场占有率位居前列",{"$f":"VLOOKUP(Sheet1!B7,'添加、修改、删除会员单位信息总表'!$A$1:$E$1505,4,FALSE)","v":"一般会员单位"},{"$f":"VLOOKUP(B7,'添加、修改、删除会员单位信息总表'!$A$1:$E$1505,5,FALSE)","v":2000},{"$f":"VLOOKUP(B7,'添加、修改、删除会员单位信息总表'!$A$1:$C$1505,2,FALSE)","v":2000}]
[6,"深圳万测试验设备有限公司","国家专精特新小巨人企业","智能化机器人全自动送样拉伸测试系统","位居前三",{"$f":"VLOOKUP(Sheet1!B8,'添加、修改、删除会员单位信息总表'!$A$1:$E$1505,4,FALSE)","v":"一般会员单位"},{"$f":"VLOOKUP(B8,'添加、修改、删除会员单位信息总表'!$A$1:$E$1505,5,FALSE)","v":2000},{"$f":"VLOOKUP(B8,'添加、修改、删除会员单位信息总表'!$A$1:$C$1505,2,FALSE)","v":0}]
[7,"中科赛凌（北京）科技有限公司","国家专精特新小巨人企业","单压缩机制冷技术生产的气候环境试验箱","国内市场位居第一",{"$f":"VLOOKUP(Sheet1!B9,'添加、修改、删除会员单位信息总表'!$A$1:$E$1505,4,FALSE)","v":"理事单位"},{"$f":"VLOOKUP(B9,'添加、修改、删除会员单位信息总表'!$A$1:$E$1505,5,FALSE)","v":5000},{"$f":"VLOOKUP(B9,'添加、修改、删除会员单位信息总表'!$A$1:$C$1505,2,FALSE)","v":5000}]
[8,"北京东西分析有限公司","国家专精特新小巨人企业","质谱仪","北京市前三",{"$f":"VLOOKUP(Sheet1!B10,'添加、修改、删除会员单位信息总表'!$A$1:$E$1505,4,FALSE)","v":"理事单位"},{"$f":"VLOOKUP(B10,'添加、修改、删除会员单位信息总表'!$A$1:$E$1505,5,FALSE)","v":5000},{"$f":"VLOOKUP(B10,'添加、修改、删除会员单位信息总表'!$A$1:$C$1505,2,FALSE)","v":0}]
[9,"北京智博联科技股份有限公司","国家专精特新小巨人企业","建筑工程质量智能无损检测仪","国内前三","一般会员单位",2000,0,"新会员"]
[10,"重庆继联机电有限公司","国家专精特新小巨人企业","的压力/差压变送器膜盒","国内前三","一般会员单位",2000,0,"新会员"]
[11,"上海知楚仪器有限公司","国家专精特新小巨人企业","司振荡培养箱（摇床）","全国第一",{"$f":"VLOOKUP(Sheet1!B13,'添加、修改、删除会员单位信息总表'!$A$1:$E$1505,4,FALSE)","v":"一般会员单位"},{"$f":"VLOOKUP(B13,'添加、修改、删除会员单位信息总表'!$A$1:$E$1505,5,FALSE)","v":2000},{"$f":"VLOOKUP(B13,'添加、修改、删除会员单位信息总表'!$A$1:$C$1505,2,FALSE)","v":2000}]
[12,"开封市测控技术有限公司","国家专精特新小巨人企业","X/β射线面密度测量仪","国内前三","一般会员单位",0,0,"新会员"]
[13,"武汉飞恩微电子有限公司","国家专精特新小巨人企业","MEMS 汽车燃油蒸汽压力传感器","市场占有率10%","一般会员单位",2000,0,"新会员"]
[14,"时代集团公司","国家专精特新小巨人企业","硬度计","国内第一",{"$f":"VLOOKUP(Sheet1!B16,'添加、修改、删除会员单位信息总表'!$A$1:$E$1505,4,FALSE)","v":"一般会员单位"},{"$f":"VLOOKUP(B16,'添加、修改、删除会员单位信息总表'!$A$1:$E$1505,5,FALSE)","v":2000},{"$f":"VLOOKUP(B16,'添加、修改、删除会员单位信息总表'!$A$1:$C$1505,2,FALSE)","v":0},"北京时代之峰科技有限公司"]
[15,"福建顺昌虹润精密仪器有限公司","国家专精特新小巨人企业","显示控制仪表","国内前三",{"$f":"VLOOKUP(Sheet1!B17,'添加、修改、删除会员单位信息总表'!$A$1:$E$1505,4,FALSE)","v":"常务理事单位"},{"$f":"VLOOKUP(B17,'添加、修改、删除会员单位信息总表'!$A$1:$E$1505,5,FALSE)","v":5000},{"$f":"VLOOKUP(B17,'添加、修改、删除会员单位信息总表'!$A$1:$C$1505,2,FALSE)","v":0}]
[16,"湖南军成科技有限公司","国家专精特新小巨人企业","武器装备智能制造非标生产线、大负载防爆机器\n人 ","国内第二",{"$f":"VLOOKUP(Sheet1!B18,'添加、修改、删除会员单位信息总表'!$A$1:$E$1505,4,FALSE)","v":{"$error":"#N/A"}},{"$f":"VLOOKUP(B18,'添加、修改、删除会员单位信息总表'!$A$1:$E$1505,5,FALSE)","v":{"$error":"#N/A"}},null,"无名称"]
[17,"江苏博克斯科技股份有限公司","国家专精特新小巨人企业","水质在线监测过程控制仪表","国内市场占有率达到15%",{"$f":"VLOOKUP(Sheet1!B19,'添加、修改、删除会员单位信息总表'!$A$1:$E$1505,4,FALSE)","v":"一般会员单位"},{"$f":"VLOOKUP(B19,'添加、修改、删除会员单位信息总表'!$A$1:$E$1505,5,FALSE)","v":2000},{"$f":"VLOOKUP(B19,'添加、修改、删除会员单位信息总表'!$A$1:$C$1505,2,FALSE)","v":2000}]
[18,"无锡智能自控工程股份有限公司","国家专精特新小巨人企业","调节阀","国内排名第四",{"$f":"VLOOKUP(Sheet1!B20,'添加、修改、删除会员单位信息总表'!$A$1:$E$1505,4,FALSE)","v":"理事单位"},{"$f":"VLOOKUP(B20,'添加、修改、删除会员单位信息总表'!$A$1:$E$1505,5,FALSE)","v":5000},{"$f":"VLOOKUP(B20,'添加、修改、删除会员单位信息总表'!$A$1:$C$1505,2,FALSE)","v":0}]
[19,"重庆川仪分析仪器有限公司","国家专精特新小巨人企业","“PS7500 水泥高温过程分析系统”“PS7400 垃圾\n焚烧烟气排放连续监测分析系统”","国内前三",{"$f":"VLOOKUP(Sheet1!B21,'添加、修改、删除会员单位信息总表'!$A$1:$E$1505,4,FALSE)","v":"一般会员单位"},{"$f":"VLOOKUP(B21,'添加、修改、删除会员单位信息总表'!$A$1:$E$1505,5,FALSE)","v":2000},{"$f":"VLOOKUP(B21,'添加、修改、删除会员单位信息总表'!$A$1:$C$1505,2,FALSE)","v":0}]
[20,"深圳三思纵横科技股份有限公司","国家专精特新小巨人企业","金属类力学试验机","全国前二",{"$f":"VLOOKUP(Sheet1!B22,'添加、修改、删除会员单位信息总表'!$A$1:$E$1505,4,FALSE)","v":"一般会员单位"},{"$f":"VLOOKUP(B22,'添加、修改、删除会员单位信息总表'!$A$1:$E$1505,5,FALSE)","v":2000},{"$f":"VLOOKUP(B22,'添加、修改、删除会员单位信息总表'!$A$1:$C$1505,2,FALSE)","v":0}]
[21,"北京北分瑞利分析仪器(集团)有限责任公司","国家专精特新小巨人企业","光谱、色谱","2019-2021市场占有率13%、15%和17%",{"$f":"VLOOKUP(Sheet1!B23,'添加、修改、删除会员单位信息总表'!$A$1:$E$1505,4,FALSE)","v":"一般会员单位"},{"$f":"VLOOKUP(B23,'添加、修改、删除会员单位信息总表'!$A$1:$E$1505,5,FALSE)","v":2000},{"$f":"VLOOKUP(B23,'添加、修改、删除会员单位信息总表'!$A$1:$C$1505,2,FALSE)","v":0}]
[22,"成都玖锦科技有限公司","国家专精特新小巨人企业","矢量信号源、射频阻抗测试仪、 矢量信号分析仪","市场占有率12%，位居同行业前三",{"$f":"VLOOKUP(Sheet1!B24,'添加、修改、删除会员单位信息总表'!$A$1:$E$1505,4,FALSE)","v":"一般会员单位"},{"$f":"VLOOKUP(B24,'添加、修改、删除会员单位信息总表'!$A$1:$E$1505,5,FALSE)","v":2000},{"$f":"VLOOKUP(B24,'添加、修改、删除会员单位信息总表'!$A$1:$C$1505,2,FALSE)","v":0}]
[23,"杭州奥盛仪器有限公司","国家专精特新小巨人企业","核酸提取仪","国内市场占有率为12%",{"$f":"VLOOKUP(Sheet1!B25,'添加、修改、删除会员单位信息总表'!$A$1:$E$1505,4,FALSE)","v":{"$error":"#N/A"}},{"$f":"VLOOKUP(B25,'添加、修改、删除会员单位信息总表'!$A$1:$E$1505,5,FALSE)","v":{"$error":"#N/A"}},0,"新会员"]
[24,"杭州仰仪科技有限公司","国家专精特新小巨人企业","量热仪","市场占有率为20%，位居国内前三",{"$f":"VLOOKUP(Sheet1!B26,'添加、修改、删除会员单位信息总表'!$A$1:$E$1505,4,FALSE)","v":"一般会员单位"},{"$f":"VLOOKUP(B26,'添加、修改、删除会员单位信息总表'!$A$1:$E$1505,5,FALSE)","v":2000},{"$f":"VLOOKUP(B26,'添加、修改、删除会员单位信息总表'!$A$1:$C$1505,2,FALSE)","v":2000}]
[25,"湖北弘仪电子科技股份有限公司","国家专精特新小巨人企业","危化品智能自动化装卸控制器及系统","市场占有率17.5%，位居国内前三",{"$f":"VLOOKUP(Sheet1!B27,'添加、修改、删除会员单位信息总表'!$A$1:$E$1505,4,FALSE)","v":{"$error":"#N/A"}},{"$f":"VLOOKUP(B27,'添加、修改、删除会员单位信息总表'!$A$1:$E$1505,5,FALSE)","v":{"$error":"#N/A"}},0,"新会员"]
[26,"青岛盛瀚色谱技术有限公司","国家专精特新小巨人企业","离子色谱仪","位居国内第二",{"$f":"VLOOKUP(Sheet1!B28,'添加、修改、删除会员单位信息总表'!$A$1:$E$1505,4,FALSE)","v":"理事单位"},{"$f":"VLOOKUP(B28,'添加、修改、删除会员单位信息总表'!$A$1:$E$1505,5,FALSE)","v":5000},{"$f":"VLOOKUP(B28,'添加、修改、删除会员单位信息总表'!$A$1:$C$1505,2,FALSE)","v":5000}]
[27,"上海睿钰生物科技有限公司","国家专精特新小巨人企业","智能图像细胞计数分析仪","市场占有率为20%，位居国内前三",{"$f":"VLOOKUP(Sheet1!B29,'添加、修改、删除会员单位信息总表'!$A$1:$E$1505,4,FALSE)","v":"一般会员单位"},{"$f":"VLOOKUP(B29,'添加、修改、删除会员单位信息总表'!$A$1:$E$1505,5,FALSE)","v":2000},{"$f":"VLOOKUP(B29,'添加、修改、删除会员单位信息总表'!$A$1:$C$1505,2,FALSE)","v":2000}]
[28,"深圳市三恩时科技有限公司","国家专精特新小巨人企业","分光测色仪","市场占有率为17%，位居国内前三",{"$f":"VLOOKUP(Sheet1!B30,'添加、修改、删除会员单位信息总表'!$A$1:$E$1505,4,FALSE)","v":"一般会员单位"},{"$f":"VLOOKUP(B30,'添加、修改、删除会员单位信息总表'!$A$1:$E$1505,5,FALSE)","v":2000},{"$f":"VLOOKUP(B30,'添加、修改、删除会员单位信息总表'!$A$1:$C$1505,2,FALSE)","v":2000}]
[29,"威胜信息技术股份有限公司","国家专精特新小巨人企业","用电信息采集终端和计量自动化终端","2020-2021年的国内市场占有率分别为11.0%、10.2%，位居国内前三。",{"$f":"VLOOKUP(Sheet1!B31,'添加、修改、删除会员单位信息总表'!$A$1:$E$1505,4,FALSE)","v":"一般会员单位"},{"$f":"VLOOKUP(B31,'添加、修改、删除会员单位信息总表'!$A$1:$E$1505,5,FALSE)","v":2000},{"$f":"VLOOKUP(B31,'添加、修改、删除会员单位信息总表'!$A$1:$C$1505,2,FALSE)","v":0}]
[30,"芯视界（北京）科技有限公司","国家专精特新小巨人企业","基于量子点光谱传感芯片物联网终端的水环境大数据系统","国内的市场占有率是37%，位居全国前三",{"$f":"VLOOKUP(Sheet1!B32,'添加、修改、删除会员单位信息总表'!$A$1:$E$1505,4,FALSE)","v":"一般会员单位"},{"$f":"VLOOKUP(B32,'添加、修改、删除会员单位信息总表'!$A$1:$E$1505,5,FALSE)","v":2000},{"$f":"VLOOKUP(B32,'添加、修改、删除会员单位信息总表'!$A$1:$C$1505,2,FALSE)","v":2000}]
[31,"浙江赛思电子科技有限公司","国家专精特新小巨人企业","网同步时钟设备","市场占有率为20%，位居国内前三",{"$f":"VLOOKUP(Sheet1!B33,'添加、修改、删除会员单位信息总表'!$A$1:$E$1505,4,FALSE)","v":{"$error":"#N/A"}},{"$f":"VLOOKUP(B33,'添加、修改、删除会员单位信息总表'!$A$1:$E$1505,5,FALSE)","v":{"$error":"#N/A"}},0,"新会员"]
[32,"浙江正泰中自控制工程有限公司","国家专精特新小巨人企业","分布式控制系统","市场占有率分别为15%、17%。位居国内前三",{"$f":"VLOOKUP(Sheet1!B34,'添加、修改、删除会员单位信息总表'!$A$1:$E$1505,4,FALSE)","v":"理事单位"},{"$f":"VLOOKUP(B34,'添加、修改、删除会员单位信息总表'!$A$1:$E$1505,5,FALSE)","v":5000},{"$f":"VLOOKUP(B34,'添加、修改、删除会员单位信息总表'!$A$1:$C$1505,2,FALSE)","v":5000}]
[33,"重庆材料研究院有限公司","国家专精特新小巨人企业","仪表功能材料","市场占有率为25%，位居全国前三",{"$f":"VLOOKUP(Sheet1!B35,'添加、修改、删除会员单位信息总表'!$A$1:$E$1505,4,FALSE)","v":"副理事长单位"},{"$f":"VLOOKUP(B35,'添加、修改、删除会员单位信息总表'!$A$1:$E$1505,5,FALSE)","v":20000},{"$f":"VLOOKUP(B35,'添加、修改、删除会员单位信息总表'!$A$1:$C$1505,2,FALSE)","v":0}]
[34,"重庆市大正仪表股份有限公司","国家专精特新小巨人企业","工业钨铼热电偶、单芯铠装热电偶","国内市场占有率分别位居前二、第一",{"$f":"VLOOKUP(Sheet1!B36,'添加、修改、删除会员单位信息总表'!$A$1:$E$1505,4,FALSE)","v":"理事单位"},{"$f":"VLOOKUP(B36,'添加、修改、删除会员单位信息总表'!$A$1:$E$1505,5,FALSE)","v":5000},{"$f":"VLOOKUP(B36,'添加、修改、删除会员单位信息总表'!$A$1:$C$1505,2,FALSE)","v":0}]
[35,"丹东奥龙射线仪器集团有限公司","国家专精特新重点小巨人企业","射线探伤仪器","全国第一",{"$f":"VLOOKUP(Sheet1!B37,'添加、修改、删除会员单位信息总表'!$A$1:$E$1505,4,FALSE)","v":"常务理事单位"},{"$f":"VLOOKUP(B37,'添加、修改、删除会员单位信息总表'!$A$1:$E$1505,5,FALSE)","v":5000},{"$f":"VLOOKUP(B37,'添加、修改、删除会员单位信息总表'!$A$1:$C$1505,2,FALSE)","v":0}]
[36,"浙江福立分析仪器股份有限公司","国家专精特新重点小巨人企业","气相色谱仪","全国第一",{"$f":"VLOOKUP(Sheet1!B38,'添加、修改、删除会员单位信息总表'!$A$1:$E$1505,4,FALSE)","v":"一般会员单位"},{"$f":"VLOOKUP(B38,'添加、修改、删除会员单位信息总表'!$A$1:$E$1505,5,FALSE)","v":2000},{"$f":"VLOOKUP(B38,'添加、修改、删除会员单位信息总表'!$A$1:$C$1505,2,FALSE)","v":0}]
[37,"西安东风机电股份有限公司","国家专精特新重点小巨人企业","科里奥利质量流量计","全国前五，国产品牌第一",{"$f":"VLOOKUP(Sheet1!B39,'添加、修改、删除会员单位信息总表'!$A$1:$E$1505,4,FALSE)","v":"一般会员单位"},{"$f":"VLOOKUP(B39,'添加、修改、删除会员单位信息总表'!$A$1:$E$1505,5,FALSE)","v":2000},{"$f":"VLOOKUP(B39,'添加、修改、删除会员单位信息总表'!$A$1:$C$1505,2,FALSE)","v":2000}]
[38,"苏州英示测量科技有限公司","国家专精特新重点小巨人企业","数字化几何量精密测量仪器及解决方案","全国第一",{"$f":"VLOOKUP(Sheet1!B40,'添加、修改、删除会员单位信息总表'!$A$1:$E$1505,4,FALSE)","v":"一般会员单位"},{"$f":"VLOOKUP(B40,'添加、修改、删除会员单位信息总表'!$A$1:$E$1505,5,FALSE)","v":2000},{"$f":"VLOOKUP(B40,'添加、修改、删除会员单位信息总表'!$A$1:$C$1505,2,FALSE)","v":2000}]
[39,"金华市蓝海光电技术有限公司","国家专精特新重点小巨人企业","激光测距仪、、激光雷达、激光测速仪、激光测距传感\n器","国内前三",{"$f":"VLOOKUP(Sheet1!B41,'添加、修改、删除会员单位信息总表'!$A$1:$E$1505,4,FALSE)","v":"一般会员单位"},{"$f":"VLOOKUP(B41,'添加、修改、删除会员单位信息总表'!$A$1:$E$1505,5,FALSE)","v":2000},{"$f":"VLOOKUP(B41,'添加、修改、删除会员单位信息总表'!$A$1:$C$1505,2,FALSE)","v":0}]
[40,"江门市润宇传感器科技有限公司","国家专精特新重点小巨人企业","磁致伸缩位移传感器高精度算法软件","国内前三",{"$f":"VLOOKUP(Sheet1!B42,'添加、修改、删除会员单位信息总表'!$A$1:$E$1505,4,FALSE)","v":"一般会员单位"},{"$f":"VLOOKUP(B42,'添加、修改、删除会员单位信息总表'!$A$1:$E$1505,5,FALSE)","v":2000},{"$f":"VLOOKUP(B42,'添加、修改、删除会员单位信息总表'!$A$1:$C$1505,2,FALSE)","v":2000}]
[41,"湖北万测试验设备有限公司","湖北省专精特新小巨人企业","微机控制电液伺服万能试验机","湖北省第一",{"$f":"VLOOKUP(Sheet1!B43,'添加、修改、删除会员单位信息总表'!$A$1:$E$1505,4,FALSE)","v":"一般会员单位"},{"$f":"VLOOKUP(B43,'添加、修改、删除会员单位信息总表'!$A$1:$E$1505,5,FALSE)","v":2000},{"$f":"VLOOKUP(B43,'添加、修改、删除会员单位信息总表'!$A$1:$C$1505,2,FALSE)","v":2000}]
[42,"济南鑫光试验机制造有限公司","济南市专精特新小巨人企业","电液伺服万能试验机","山东省前三",{"$f":"VLOOKUP(Sheet1!B44,'添加、修改、删除会员单位信息总表'!$A$1:$E$1505,4,FALSE)","v":"理事单位"},{"$f":"VLOOKUP(B44,'添加、修改、删除会员单位信息总表'!$A$1:$E$1505,5,FALSE)","v":5000},{"$f":"VLOOKUP(B44,'添加、修改、删除会员单位信息总表'!$A$1:$C$1505,2,FALSE)","v":0}]
[43,"南京霍普斯科技有限公司","江苏省专精特新小巨人企业","品固定污染源非甲烷总烃连续监测系统","国内市场位居前五",{"$f":"VLOOKUP(Sheet1!B45,'添加、修改、删除会员单位信息总表'!$A$1:$E$1505,4,FALSE)","v":"一般会员单位"},{"$f":"VLOOKUP(B45,'添加、修改、删除会员单位信息总表'!$A$1:$E$1505,5,FALSE)","v":2000},{"$f":"VLOOKUP(B45,'添加、修改、删除会员单位信息总表'!$A$1:$C$1505,2,FALSE)","v":2000}]
[44,"常州米德克光电科技有限公司","常州市专精特新中小企业","激光水平仪","国内市场位居前列",{"$f":"VLOOKUP(Sheet1!B46,'添加、修改、删除会员单位信息总表'!$A$1:$E$1505,4,FALSE)","v":"一般会员单位"},{"$f":"VLOOKUP(B46,'添加、修改、删除会员单位信息总表'!$A$1:$E$1505,5,FALSE)","v":2000},{"$f":"VLOOKUP(B46,'添加、修改、删除会员单位信息总表'!$A$1:$C$1505,2,FALSE)","v":2000}]
[45,"南京江南永新光学有限公司","南京市专精特新小巨人企业","光学显微镜","国内第四",{"$f":"VLOOKUP(Sheet1!B47,'添加、修改、删除会员单位信息总表'!$A$1:$E$1505,4,FALSE)","v":"理事单位"},{"$f":"VLOOKUP(B47,'添加、修改、删除会员单位信息总表'!$A$1:$E$1505,5,FALSE)","v":5000},{"$f":"VLOOKUP(B47,'添加、修改、删除会员单位信息总表'!$A$1:$C$1505,2,FALSE)","v":5000}]
[46,"南京沃天科技股份有限公司","江苏省专精特新小巨人企业","硅压阻式压力传感器","国内排名第三",{"$f":"VLOOKUP(Sheet1!B48,'添加、修改、删除会员单位信息总表'!$A$1:$E$1505,4,FALSE)","v":"理事单位"},{"$f":"VLOOKUP(B48,'添加、修改、删除会员单位信息总表'!$A$1:$E$1505,5,FALSE)","v":5000},{"$f":"VLOOKUP(B48,'添加、修改、删除会员单位信息总表'!$A$1:$C$1505,2,FALSE)","v":5000}]
[47,"无锡冠亚恒温制冷技术有限公司","无锡市专精特新小巨人企业","品制冷加热控温系统","江苏前三",{"$f":"VLOOKUP(Sheet1!B49,'添加、修改、删除会员单位信息总表'!$A$1:$E$1505,4,FALSE)","v":"一般会员单位"},{"$f":"VLOOKUP(B49,'添加、修改、删除会员单位信息总表'!$A$1:$E$1505,5,FALSE)","v":2000},{"$f":"VLOOKUP(B49,'添加、修改、删除会员单位信息总表'!$A$1:$C$1505,2,FALSE)","v":2000}]
[48,"内蒙古光能科技有限公司","内蒙古自治区专精特新小巨人企业","高灵敏度微量气体分析仪","在内蒙古自治区位居第一",{"$f":"VLOOKUP(Sheet1!B50,'添加、修改、删除会员单位信息总表'!$A$1:$E$1505,4,FALSE)","v":"一般会员单位"},{"$f":"VLOOKUP(B50,'添加、修改、删除会员单位信息总表'!$A$1:$E$1505,5,FALSE)","v":2000},{"$f":"VLOOKUP(B50,'添加、修改、删除会员单位信息总表'!$A$1:$C$1505,2,FALSE)","v":0}]
[49,"浙江至控科技有限公司","制造业单项冠军产品","自主可控 PLC","在国防军工领域国内前三",{"$f":"VLOOKUP(Sheet1!B51,'添加、修改、删除会员单位信息总表'!$A$1:$E$1505,4,FALSE)","v":"一般会员单位"},{"$f":"VLOOKUP(B51,'添加、修改、删除会员单位信息总表'!$A$1:$E$1505,5,FALSE)","v":2000},{"$f":"VLOOKUP(B51,'添加、修改、删除会员单位信息总表'!$A$1:$C$1505,2,FALSE)","v":2000},"浙江至控科技有限公司"]
[50,"无锡日联科技股份有限公司","制造业单项冠军产品"," X 射线智能检测装备","全国第一，全球前三。",{"$f":"VLOOKUP(Sheet1!B52,'添加、修改、删除会员单位信息总表'!$A$1:$E$1505,4,FALSE)","v":"一般会员单位"},{"$f":"VLOOKUP(B52,'添加、修改、删除会员单位信息总表'!$A$1:$E$1505,5,FALSE)","v":2000},{"$f":"VLOOKUP(B52,'添加、修改、删除会员单位信息总表'!$A$1:$C$1505,2,FALSE)","v":2000}]
[51,"中机试验装备股份有限公司","制造业单项冠军产品","高温持久蠕变疲劳试验机","全国第一",{"$f":"VLOOKUP(Sheet1!B53,'添加、修改、删除会员单位信息总表'!$A$1:$E$1505,4,FALSE)","v":"副理事长单位"},{"$f":"VLOOKUP(B53,'添加、修改、删除会员单位信息总表'!$A$1:$E$1505,5,FALSE)","v":20000},{"$f":"VLOOKUP(B53,'添加、修改、删除会员单位信息总表'!$A$1:$C$1505,2,FALSE)","v":0}]
[52,"深圳万测试验设备有限公司","制造业单项冠军产品","全自动电子拉力试验机","全国第一",{"$f":"VLOOKUP(Sheet1!B54,'添加、修改、删除会员单位信息总表'!$A$1:$E$1505,4,FALSE)","v":"一般会员单位"},{"$f":"VLOOKUP(B54,'添加、修改、删除会员单位信息总表'!$A$1:$E$1505,5,FALSE)","v":2000},{"$f":"VLOOKUP(B54,'添加、修改、删除会员单位信息总表'!$A$1:$C$1505,2,FALSE)","v":0}]
[53,"深圳市中图仪器科技有限公司","制造业单项冠军产品","精密 3D测量仪器","位居前列",{"$f":"VLOOKUP(Sheet1!B55,'添加、修改、删除会员单位信息总表'!$A$1:$E$1505,4,FALSE)","v":"一般会员单位"},{"$f":"VLOOKUP(B55,'添加、修改、删除会员单位信息总表'!$A$1:$E$1505,5,FALSE)","v":2000},{"$f":"VLOOKUP(B55,'添加、修改、删除会员单位信息总表'!$A$1:$C$1505,2,FALSE)","v":2000},"深圳市中图仪器科技有限公司"]
[54,"苏州苏试试验集团股份有限公司","制造业单项冠军产品","力学环境振动试验设备","全国第一",{"$f":"VLOOKUP(Sheet1!B56,'添加、修改、删除会员单位信息总表'!$A$1:$E$1505,4,FALSE)","v":"副理事长单位"},{"$f":"VLOOKUP(B56,'添加、修改、删除会员单位信息总表'!$A$1:$E$1505,5,FALSE)","v":20000},{"$f":"VLOOKUP(B56,'添加、修改、删除会员单位信息总表'!$A$1:$C$1505,2,FALSE)","v":20000},"苏州苏试试验集团股份有限公司"]
[55,"苏州英示测量科技有限公司","制造业单项冠军产品","数字化测量量具","全国第一",{"$f":"VLOOKUP(Sheet1!B57,'添加、修改、删除会员单位信息总表'!$A$1:$E$1505,4,FALSE)","v":"一般会员单位"},{"$f":"VLOOKUP(B57,'添加、修改、删除会员单位信息总表'!$A$1:$E$1505,5,FALSE)","v":2000},{"$f":"VLOOKUP(B57,'添加、修改、删除会员单位信息总表'!$A$1:$C$1505,2,FALSE)","v":2000}]
[56,"菲尼克斯(中国)投资有限公司","制造业单项冠军产品","柜内连接器","全国第一",{"$f":"VLOOKUP(Sheet1!B58,'添加、修改、删除会员单位信息总表'!$A$1:$E$1505,4,FALSE)","v":"理事单位"},{"$f":"VLOOKUP(B58,'添加、修改、删除会员单位信息总表'!$A$1:$E$1505,5,FALSE)","v":5000},{"$f":"VLOOKUP(B58,'添加、修改、删除会员单位信息总表'!$A$1:$C$1505,2,FALSE)","v":0},"菲尼克斯(中国)投资有限公司"]
[57,"安徽天康（集团）股份有限公司","制造业单项冠军产品","热电偶、热电阻、双金属温度计","全国第一",{"$f":"VLOOKUP(Sheet1!B59,'添加、修改、删除会员单位信息总表'!$A$1:$E$1505,4,FALSE)","v":"常务理事单位"},{"$f":"VLOOKUP(B59,'添加、修改、删除会员单位信息总表'!$A$1:$E$1505,5,FALSE)","v":5000},{"$f":"VLOOKUP(B59,'添加、修改、删除会员单位信息总表'!$A$1:$C$1505,2,FALSE)","v":5000}]
[58,"郑州炜盛电子科技有限公司","制造业单项冠军产品","气体传感器","全国第一",{"$f":"VLOOKUP(Sheet1!B60,'添加、修改、删除会员单位信息总表'!$A$1:$E$1505,4,FALSE)","v":{"$error":"#N/A"}},{"$f":"VLOOKUP(B60,'添加、修改、删除会员单位信息总表'!$A$1:$E$1505,5,FALSE)","v":{"$error":"#N/A"}},null,"无名称"]
[59,"上海知楚仪器有限公司","制造业单项冠军产品","振荡培养箱（摇床）","全国第一",{"$f":"VLOOKUP(Sheet1!B61,'添加、修改、删除会员单位信息总表'!$A$1:$E$1505,4,FALSE)","v":"一般会员单位"},{"$f":"VLOOKUP(B61,'添加、修改、删除会员单位信息总表'!$A$1:$E$1505,5,FALSE)","v":2000},{"$f":"VLOOKUP(B61,'添加、修改、删除会员单位信息总表'!$A$1:$C$1505,2,FALSE)","v":2000}]
[60,"威胜集团有限公司","单项冠军复核评价","三相电子式电能表","全国第一",{"$f":"VLOOKUP(Sheet1!B62,'添加、修改、删除会员单位信息总表'!$A$1:$E$1505,4,FALSE)","v":"副理事长单位"},{"$f":"VLOOKUP(B62,'添加、修改、删除会员单位信息总表'!$A$1:$E$1505,5,FALSE)","v":20000},{"$f":"VLOOKUP(B62,'添加、修改、删除会员单位信息总表'!$A$1:$C$1505,2,FALSE)","v":20000}]
[61,"承德热河克罗尼仪表有限公司","河北省第四批制造业单项冠军","品金属管浮\n子流量计","河北省第一，国内前三",{"$f":"VLOOKUP(Sheet1!B63,'添加、修改、删除会员单位信息总表'!$A$1:$E$1505,4,FALSE)","v":"理事单位"},{"$f":"VLOOKUP(B63,'添加、修改、删除会员单位信息总表'!$A$1:$E$1505,5,FALSE)","v":5000},{"$f":"VLOOKUP(B63,'添加、修改、删除会员单位信息总表'!$A$1:$C$1505,2,FALSE)","v":0}]
[62,"麦克奥迪实业集团有限公司","福建省重点培育和发展的国际知名品牌","光学显微镜","国内市场位居前列",{"$f":"VLOOKUP(Sheet1!B64,'添加、修改、删除会员单位信息总表'!$A$1:$E$1505,4,FALSE)","v":"理事单位"},{"$f":"VLOOKUP(B64,'添加、修改、删除会员单位信息总表'!$A$1:$E$1505,5,FALSE)","v":5000},{"$f":"VLOOKUP(B64,'添加、修改、删除会员单位信息总表'!$A$1:$C$1505,2,FALSE)","v":5000}]
[63,"中国四联仪器仪表集团有限公司","重点领域补短板的情况证明","PDS 智能压力变送器系列","国产品牌排名第一",{"$f":"VLOOKUP(Sheet1!B65,'添加、修改、删除会员单位信息总表'!$A$1:$E$1505,4,FALSE)","v":"理事长单位"},{"$f":"VLOOKUP(B65,'添加、修改、删除会员单位信息总表'!$A$1:$E$1505,5,FALSE)","v":50000},{"$f":"VLOOKUP(B65,'添加、修改、删除会员单位信息总表'!$A$1:$C$1505,2,FALSE)","v":50000},"中国四联仪器仪表集团有限公司"]
[64,"重庆苏试四达试验设备有限公司","重庆市企业技术中心认定","综合情况","国内前三",{"$f":"VLOOKUP(Sheet1!B66,'添加、修改、删除会员单位信息总表'!$A$1:$E$1505,4,FALSE)","v":"理事单位"},{"$f":"VLOOKUP(B66,'添加、修改、删除会员单位信息总表'!$A$1:$E$1505,5,FALSE)","v":5000},{"$f":"VLOOKUP(B66,'添加、修改、删除会员单位信息总表'!$A$1:$C$1505,2,FALSE)","v":5000}]
[65,"重庆川仪自动化股份有限公司","制造业“一链一网一平台”揭榜挂帅项目","综合情况","具备仪器仪表行业产业链“链主”地位",{"$f":"VLOOKUP(Sheet1!B67,'添加、修改、删除会员单位信息总表'!$A$1:$E$1505,4,FALSE)","v":{"$error":"#N/A"}},{"$f":"VLOOKUP(B67,'添加、修改、删除会员单位信息总表'!$A$1:$E$1505,5,FALSE)","v":{"$error":"#N/A"}}]
[{"$nulls":7},{"$f":"SUM(H3:H67)","v":174000}]

{"sheet":"添加、修改、删除会员单位信息总表","index":1,"n_rows":1505,"n_cols":5,"rows_kept":1505}
["单位名称","合计2022年","收款时间-2022","会员级别","会费标准"]
["上海百若试验仪器有限公司",0,null,"一般会员单位",2000]
["长春因赛图精密仪器设备有限公司",0,null,"一般会员单位",2000]
["胜利油田东强机电设备制造有限公司",2000,"2022-01-04","一般会员单位",2000]
["杭州赛加得传感器有限公司",0,null,"一般会员单位",2000]
["武汉中原电子信息有限公司",0,null,"一般会员单位",2000]
["西安北成电子有限责任公司",2000,"2022-03-09","一般会员单位",2000]
["重庆山马电表有限公司",0,null,"一般会员单位",2000]
["大庆市伟杰钻采技术开发有限公司",0,null,"一般会员单位",2000]
["北京镁伽机器人科技有限公司",0,null,"一般会员单位",2000]
["广州市锦泉仪器科技有限公司",0,null,"一般会员单位",2000]
["河南润辉科技有限公司",0,null,"一般会员单位",2000]
["郑州克莱克特科学仪器有限公司",0,null,"一般会员单位",2000]
["长春市智能仪器设备有限公司",0,null,"一般会员单位",2000]
["杭州鑫高科技有限公司",0,null,"一般会员单位",2000]
["武汉华美生物工程有限公司",0,null,"一般会员单位",2000]
["郑州华洲食品检测科技有限公司",0,null,"一般会员单位",2000]
["杭州春来科技有限公司",0,null,"一般会员单位",2000]
["武汉上成生物科技有限公司",0,null,"一般会员单位",2000]
["成都玖锦科技有限公司",0,null,"一般会员单位",2000]
["武汉中科志康生物科技有限公司",0,null,"一般会员单位",2000]
["湖南中仪器材进出口有限公司",0,null,"一般会员单位",2000]
["北京海林自控科技股份有限公司",2000,"2022-03-03","一般会员单位",2000]
["常州米德克光电科技有限公司",2000,"2022-03-03","一般会员单位",2000]
["大连中工策控科技有限公司",2000,"2022-03-03","一般会员单位",2000]
["广州广电计量检查股份有限公司",0,null,"一般会员单位",2000]
["杭州思看科技有限公司",0,null,"一般会员单位",2000]
["鹤壁精中科技有限公司",0,null,"一般会员单位",2000]
["江门市润宇传感器科技有限公司",2000,"2022-04-24","一般会员单位",2000]
["江元（天长）科技股份有限公司",2000,"2022-03-07","一般会员单位",2000]
["四川阳辰信通科技有限公司",0,null,"一般会员单位",2000]
["吉林省赛维特姆科技有限公司",0,null,"一般会员单位",2000]
["天津三英精密仪器股份有限公司",2000,"2022-03-03","一般会员单位",2000]
["大连励成实验室服务有限公司",0,null,"一般会员单位",2000]
["中科赛凌（北京）科技有限公司",5000,"2022-05-18","理事单位",5000]
["杭州集智机电股份有限公司",0,null,"理事单位",5000]
["上海衡望智能科技有限公司",0,null,"一般会员单位",2000]
["博侃电气（合肥）有限公司",0,null,"一般会员单位",2000]
["和昌电业（肇庆）有限公司",0,null,"一般会员单位",2000]
["上海晋想仪表科技有限公司",0,null,"一般会员单位",2000]
["深圳市泽合生物科技有限公司",0,null,"一般会员单位",2000]
["四川精卫食品检测科技有限公司",0,null,"一般会员单位",2000]
["重庆微奥云生物技术有限公司",0,null,"一般会员单位",2000]
["东莞市日臻尚勤电工材料有限公司",0,null,"一般会员单位",2000]
["广东立佳实业有限公司",0,null,"一般会员单位",2000]
["怀化建南电子科技有限公司",0,null,"一般会员单位",2000]
["伊莎贝棱辉特（上海）电子科技贸易有限公司",0,null,"一般会员单位",2000]
["北京天宇沃特仪表科技有限公司",2000,"2022-03-16","一般会员单位",2000]
["上海纤检仪器有限公司",0,null,"一般会员单位",2000]
["上海如海光电科技有限公司",0,null,"一般会员单位",2000]
["北京格瑞德曼仪器设备有限公司",0,null,"一般会员单位",2000]
["四川物讯科技有限公司",0,null,"一般会员单位",2000]
["厦门市时创自动控制工程有限公司",0,null,"一般会员单位",2000]
["湖南析瑞科技有限公司",0,null,"一般会员单位",2000]
["北京福腾宝科技发展有限公司",0,null,"一般会员单位",2000]
["兰州交通大学测绘与地理信息学院",0,null,"一般会员单位",2000]
["承德市恒伟电子设备制造有限公司",0,null,"一般会员单位",2000]
["淄博伟泰工业控制技术有限公司",0,null,"一般会员单位",2000]
["昌乐县标王化工仪表有限公司",0,null,"一般会员单位",2000]
["承德市中威电子有限公司",0,null,"一般会员单位",2000]
["招远市东朋自动化仪表有限公司",0,null,"一般会员单位",2000]
["山东英维思测控科技有限公司",0,null,"一般会员单位",2000]
["淄博盖米测控系统有限公司",0,null,"一般会员单位",2000]
["山东科迈测控技术有限公司",0,null,"一般会员单位",2000]
["山东中博流体科技有限公司",0,null,"一般会员单位",2000]
["淄博新时代仪表制造有限公司",0,null,"一般会员单位",2000]
["山东麦立淇工业自动化技术设备有限公司",0,null,"一般会员单位",2000]
["淄博珈禾弼源电气有限公司",0,null,"一般会员单位",2000]
["山东博鸿电气股份有限公司",0,null,"一般会员单位",2000]
["山东恒光电子科技有限公司",0,null,"一般会员单位",2000]
["山东福瑞德测控系统有限公司",0,null,"一般会员单位",2000]
["南京丹迪克电力仪表有限公司",2000,"2022-03-07","一般会员单位",2000]
["武汉磐电科技股份有限公司",2000,"2022-03-10","一般会员单位",2000]
["中山市东凤镇柏林顿电子电器厂",0,null,"一般会员单位",2000]
["上海妙迪仪表有限公司",0,null,"一般会员单位",2000]
["SMC（中国）有限公司",0,null,"一般会员单位",2000]
["国家光电测距仪检测中心",0,null,"一般会员单位",2000]
["无锡华普微电子有限公司",0,null,"一般会员单位",2000]
["本钢高远实业发展有限公司",0,null,"一般会员单位",2000]
["大唐联仪科技有限公司",0,null,"一般会员单位",2000]
["融智生物科技（青岛）有限公司",2000,"2022-03-10","一般会员单位",2000]
["青岛聚创环保集团有限公司",0,null,"一般会员单位",2000]
["青岛佳明测控科技股份有限公司",0,null,"一般会员单位",2000]
["郑州安诺科学仪器有限公司",0,null,"一般会员单位",2000]
["北京测尔康生物技术有限公司",0,null,"一般会员单位",2000]
["灏科仪器设计（大连）有限公司",0,null,"一般会员单位",2000]
["湖南平凡科技有限公司",0,null,"一般会员单位",2000]
["东莞市宝大仪器有限公司",0,null,"一般会员单位",2000]
["屹谱仪器制造（上海）有限公司",0,null,"一般会员单位",2000]
["宁夏绿水青山试验机有限公司",0,null,"一般会员单位",2000]
["苏州贝特智能仪表有限公司",0,null,"一般会员单位",2000]
["丹东百特仪器有限公司",0,null,"一般会员单位",2000]
["成都长城开发科技有限公司",2000,"2022-03-21","一般会员单位",2000]
["上海澄峰科技股份有限公司",0,null,"一般会员单位",2000]
["黄骅菲斯福实验仪器有限公司",0,null,"一般会员单位",2000]
["杭州中旺科技有限公司",0,null,"一般会员单位",2000]
["浙江易杰自动化有限公司",0,null,"一般会员单位",2000]
["哈尔滨市步长科技有限公司",0,null,"一般会员单位",2000]
["深圳市日联科技有限公司",0,null,"一般会员单位",2000]
["杭州朗杰测控技术开发有限公司",0,null,"一般会员单位",2000]
["上海剑平动平衡机制造有限公司",2000,"2022-03-09","一般会员单位",2000]
["济南鑫光试验机制造有限公司",0,null,"理事单位",5000]
["天津市港源试验仪器厂",0,null,"一般会员单位",2000]
["力试（上海）科学仪器有限公司",0,null,"一般会员单位",2000]
["普拉瑞思科学仪器（苏州）有限公司",0,null,"一般会员单位",2000]
["苏州双金实业有限公司",2000,"2022-03-03","一般会员单位",2000]
["四川可达源科技有限公司",0,null,"一般会员单位",2000]
["上海科颐维电子科技有限公司",0,null,"一般会员单位",2000]
["江苏汇鸿国际集团外经有限公司",0,null,"一般会员单位",2000]
["宜昌兆峰自动化仪表有限责任公司",0,null,"一般会员单位",2000]
["江苏沪振科技有限公司",0,null,"一般会员单位",2000]
["江苏德高物联技术有限公司",0,null,"一般会员单位",2000]
["无锡市华机机械制造有限公司",0,null,"一般会员单位",2000]
["陕西科瑞迪机电设备有限公司",0,null,"一般会员单位",2000]
["浙江礼显试验仪器制造有限公司",0,null,"一般会员单位",2000]
["温州三和量具仪器有限公司",0,null,"一般会员单位",2000]
["中测测控（西安）研究院有限公司",0,null,"一般会员单位",2000]
["上海华之光谱仪器有限公司",0,null,"一般会员单位",2000]
["浙江永盛科技股份有限公司",0,null,"一般会员单位",2000]
["宁波北角生物科技有限公司",0,null,"一般会员单位",2000]
{"$rows_left_out":1386}
{"sheet":"Sheet3","index":2,"n_rows":125,"n_cols":2,"rows_kept":125}
["班雪豪","\t安二玲"]
["陈超","\t陈超"]
["陈琛","\t陈琛"]
["陈景平","\t陈景平"]
["陈韶华","\t陈世银"]
["陈世银","\t陈潇炜"]
["陈潇炜","\t陈则新"]
["陈则新","\t程得恩"]
["程得恩","\t崔从敏"]
["单体珺","\t单体珺"]
["董强","\t董强"]
["董珊","\t窦佳欢"]
["窦佳欢","\t付永亮"]
["付强","\t高大会"]
["付永亮","\t辜美来"]
["高大会","\t郭唤斌"]
["高迪","\t郭帅"]
["辜美来","\t国稳稳"]
["郭唤斌","\t哈丹琦·哈哈尔"]
["郭帅","\t郝志杰"]
["哈丹琦·哈哈尔","\t何敏"]
["郝永刚","\t胡博"]
["郝志杰","\t霍乾"]
["何敏","\t霍欣"]
["霍乾","\t蒋琰"]
["霍欣","\t焦彬"]
["贾建峰","\t孔樊强"]
["蒋琰","\t孔小辉"]
["焦彬","\t李刚"]
["孔樊强","\t李琳"]
["孔维鑫","\t李王昊"]
["孔小辉","\t李鑫"]
["李刚","\t李垚"]
["李琳","\t李野"]
["李首阳","\t李云涛"]
["李垚","\t李志鹏"]
["李野","\t梁克敏"]
["李云涛","\t林展鸿"]
["李志鹏","\t刘鹏"]
["林丰义","\t刘信"]
["林展鸿","\t刘毅"]
["刘大江","\t陆敏"]
["刘鹏","\t路宇"]
["刘淑卿","\t罗子杰"]
["刘信","\t马征"]
["刘毅","\t马忠"]
["陆敏","\t孟超伟"]
["路宇","\t亓勇"]
["罗子杰","\t邵剑"]
["马征","\t宋庚"]
["马忠","\t宋巍"]
["孟超伟","\t宋晓会"]
["彭松","\t苏宁"]
["戚天龙","\t孙凯"]
["亓勇","\t田锡凯"]
["祁二飞","\t宛宇生"]
["强华盛","\t王晨伟"]
["邵剑","\t王春森"]
["沈滨","\t王剑"]
["宋庚","\t王剑荣"]
["宋巍","\t王岚"]
["宋晓会","\t王亮"]
["苏宁","\t王琳"]
["孙凯","\t王文娟"]
["田锡凯","\t王旭阳"]
["宛宇生","\t王轩"]
["王晨伟","\t王璇"]
["王春森","\t王亚杰"]
["王剑","\t王钰"]
["王剑荣","\t王志强"]
["王乐春","\t王子"]
["王亮","\t吴君超"]
["王琳","\t向东"]
["王帅","\t邢子寒"]
["王文娟","\t徐昕"]
["王旭阳","\t许运红"]
["王轩","\t杨昌国"]
["王璇","\t杨成强"]
["王亚杰","\t杨春梅"]
["王钰","\t杨洁"]
["王志强","\t杨磊"]
["王忠","\t杨明昊"]
["王子","\t杨鸣哗"]
["魏金风","\t杨文冬"]
["文新华","\t杨燕妮"]
["吴君超","\t于英杰"]
["习婕","\t袁超"]
["向东","\t张彪"]
["邢子寒","\t张峰磊"]
["徐昕","\t张河斌"]
["许超","\t张洪阁"]
["许运红","\t张宁"]
["杨昌国","\t张山"]
["杨成强","\t张帅坤"]
["杨洁","\t张双燕"]
["杨磊","\t张伟明"]
["杨明昊","\t张伟伟"]
["杨鸣哗","\t张先波"]
["杨文冬","\t张歆"]
["杨燕妮","\t张亚南"]
["尹健","\t赵汉青"]
["于英杰","\t赵庆国"]
["袁超","\t赵卓正"]
["张彪","\t钟本营"]
["张峰磊","\t钟晓光"]
["张河斌","\t周西春"]
["张洪阁","\t周勇智"]
["张山","\t朱琳"]
["张帅坤","\t朱宇锋"]
["张双燕"]
["张伟明"]
["张伟伟"]
["张先波"]
["张歆"]
["张亚南"]
["赵汉青"]
["赵庆国"]
["赵卓正"]
["钟本营"]
["钟晓光"]
{"$rows_left_out":5}